Target
Acyl-CoA wax alcohol acyltransferase 2
Ligand
BDBM50433271
Substrate
Meas. Tech.
ChEMBL_957771 (CHEMBL2378804)
IC50
>100000±n/a nM
Citation
 Barlind, JGBuckett, LKCrosby, SGDavidsson, ÖEmtenäs, HErtan, AJurva, ULemurell, MGutierrez, PMNilsson, KO'Mahony, GPetersson, AURedzic, AWågberg, FYuan, ZQ Identification and design of a novel series of MGAT2 inhibitors. Bioorg Med Chem Lett 23:2721-6 (2013)  
Target
Name:
Acyl-CoA wax alcohol acyltransferase 2
Synonyms:
ARAT AWAT2_HUMAN DC4 Diacylglycerol O-acyltransferase 2-like protein 4 Long-chain-alcohol O-fatty-acyltransferase 2 Multifunctional O-acyltransferase WS hDC4 | hWS
Type:
PROTEIN
Mol. Mass.:
38111.73
Organism:
Homo sapiens (Human)
Description:
ChEMBL_107584
Residue:
333
  
Inhibitor
Name:
BDBM50433271
Synonyms:
CHEMBL2376327
Type:
Small organic molecule
Emp. Form.:
C18H18ClN3O4S
Mol. Mass.:
407.871
SMILES:
CCC1(C)NC(=O)c2cc(ccc2NC1=O)S(=O)(=O)Nc1ccccc1Cl
: