Target
Acyl-CoA wax alcohol acyltransferase 1
Ligand
BDBM50433269
Substrate
Meas. Tech.
ChEMBL_957843 (CHEMBL2378918)
IC50
>100000±n/a nM
Citation
 Barlind, JGBuckett, LKCrosby, SGDavidsson, ÖEmtenäs, HErtan, AJurva, ULemurell, MGutierrez, PMNilsson, KO'Mahony, GPetersson, AURedzic, AWågberg, FYuan, ZQ Identification and design of a novel series of MGAT2 inhibitors. Bioorg Med Chem Lett 23:2721-6 (2013)  
Target
Name:
Acyl-CoA wax alcohol acyltransferase 1
Synonyms:
AWAT1 DGA2 Diacylglycerol O-acyltransferase 2-like protein 3 Long-chain-alcohol O-fatty-acyltransferase 1
Type:
PROTEIN
Mol. Mass.:
37775.23
Organism:
Homo sapiens (Human)
Description:
ChEMBL_107585
Residue:
328
  
Inhibitor
Name:
BDBM50433269
Synonyms:
CHEMBL2376303
Type:
Small organic molecule
Emp. Form.:
C18H17F2N3O4S
Mol. Mass.:
409.407
SMILES:
CC[C@]1(C)NC(=O)c2cc(ccc2NC1=O)S(=O)(=O)Nc1ccc(F)cc1F
: