Target
Cytochrome P450 2C9
Ligand
BDBM50116067
Substrate
Meas. Tech.
ChEMBL_956255 (CHEMBL2379432)
IC50
>20000±n/a nM
Citation
 Suzuki, HUtsunomiya, IShudo, KFukuhara, NIwaki, TYasukata, T Antibacterial oxazolidinone analogues having a N-hydroxyacetyl-substituted seven-membered [1,2,5]triazepane or [1,2,5]oxadiazepane C-ring unit. Eur J Med Chem 63:811-25 (2013)  
Target
Name:
Cytochrome P450 2C9
Synonyms:
(R)-limonene 6-monooxygenase CP2C9_HUMAN CYP2C9 Cytochrome P450 2C9 (CYP2C9 ) P-450MP P450 PB-1 | S-mephenytoin 4-hydroxylase
Type:
Enzyme
Mol. Mass.:
55636.33
Organism:
Homo sapiens (Human)
Description:
P11712
Residue:
490
  
Inhibitor
Name:
BDBM50116067
Synonyms:
(Linezolid)N-[3-(3-Fluoro-4-morpholin-4-yl-phenyl)-2-oxo-oxazolidin-5-ylmethyl]-acetamide (S)-3-(3-Fluoro-4-morpholin-4-yl-phenyl)-5-[(1-hydroxy-ethylamino)-methyl]-oxazolidin-2-one (S)-N-((3-fluoro-4-morpholinophenyl)-2-oxaoxazolidin-5-yl)methyl)acetamide CHEMBL126 Linezoid N-[(R)-3-(3-Fluoro-4-morpholin-4-yl-phenyl)-2-oxo-oxazolidin-5-ylmethyl]-acetamide N-[3-(3-Fluoro-4-morpholin-4-yl-phenyl)-2-oxo-oxazolidin-5-ylmethyl]-acetamide N-{[(5S)-3-(3-fluoro-4-morpholin-4-ylphenyl)-2-oxo-1,3-oxazolidin-5-yl]methyl}acetamide Zyvox | cid_441401
Type:
Small organic molecule
Emp. Form.:
C16H20FN3O4
Mol. Mass.:
337.3461
SMILES:
CC(=O)NC[C@H]1CN(C(=O)O1)c1ccc(N2CCOCC2)c(F)c1
: