Target
5'-AMP-activated protein kinase subunit beta-1
Ligand
BDBM50434750
Substrate
Meas. Tech.
ChEMBL_961928 (CHEMBL2390519)
IC50
960±n/a nM
Citation
 Engers, DWFrist, AYLindsley, CWHong, CCHopkins, CR Synthesis and structure-activity relationships of a novel and selective bone morphogenetic protein receptor (BMP) inhibitor derived from the pyrazolo[1.5-a]pyrimidine scaffold of dorsomorphin: the discovery of ML347 as an ALK2 versus ALK3 selective MLPCN probe. Bioorg Med Chem Lett 23:3248-52 (2013)  
Target
Name:
5'-AMP-activated protein kinase subunit beta-1
Synonyms:
5'-AMP-activated protein kinase subunit beta-1 AMP-activated protein kinase alpha-2/beta-1/gamma-3 AMPK subunit beta-1 PRKAB1
Type:
Mol. Mass.:
30380.94
Organism:
Homo sapiens (Human)
Description:
Q9Y478
Residue:
270
  
Inhibitor
Name:
BDBM50434750
Synonyms:
CHEMBL2385596
Type:
Small organic molecule
Emp. Form.:
C26H24N6
Mol. Mass.:
420.509
SMILES:
CN1CCN(CC1)c1ccc(cc1)-c1cnc2c(cnn2c1)-c1ccnc2ccccc12
: