Target
Proteasome subunit beta type-5
Ligand
BDBM50434764
Substrate
Meas. Tech.
ChEMBL_962205 (CHEMBL2388793)
Ki
98±n/a nM
Citation
 Micale, NEttari, RLavecchia, ADi Giovanni, CScarbaci, KTroiano, VGrasso, SNovellino, ESchirmeister, TZappalà, M Development of peptidomimetic boronates as proteasome inhibitors. Eur J Med Chem 64:23-34 (2013)  
Target
Name:
Proteasome subunit beta type-5
Synonyms:
20S proteasome chymotrypsin-like LMPX PSB5_HUMAN Proteasome Macropain subunit MB1 X
Type:
Protein
Mol. Mass.:
28480.96
Organism:
Homo sapiens (Human)
Description:
Residue:
263
  
Inhibitor
Name:
BDBM50434764
Synonyms:
CHEMBL2385814
Type:
Small organic molecule
Emp. Form.:
C18H24BN3O4
Mol. Mass.:
357.212
SMILES:
CC(C)C[C@H](NC(=O)Cn1ccc(Nc2ccccc2)cc1=O)B(O)O
: