Target
G-protein coupled receptor 55
Ligand
BDBM50398218
Substrate
Meas. Tech.
ChEMBL_963381 (CHEMBL2388878)
IC50
113±n/a nM
Citation
 Rempel, VVolz, NGläser, FNieger, MBräse, SMüller, CE Antagonists for the orphan G-protein-coupled receptor GPR55 based on a coumarin scaffold. J Med Chem 56:4798-810 (2013)  
Target
Name:
G-protein coupled receptor 55
Synonyms:
G protein-coupled receptor 55 GPR55_HUMAN
Type:
PROTEIN
Mol. Mass.:
36649.72
Organism:
Homo sapiens (Human)
Description:
ChEMBL_1292265
Residue:
319
  
Inhibitor
Name:
BDBM50398218
Synonyms:
CHEMBL2181542
Type:
Small organic molecule
Emp. Form.:
C26H32O4
Mol. Mass.:
408.5299
SMILES:
CCCCCCCC(C)(C)c1cc(O)c2cc(Cc3ccccc3O)c(=O)oc2c1
: