Target
Aminopeptidase N
Ligand
BDBM23971
Substrate
Meas. Tech.
ChEMBL_963630 (CHEMBL2395149)
IC50
8100±n/a nM
Citation
 Su, LJia, YWang, XZhang, LFang, HXu, W Discovery of a synthetic Aminopeptidase N inhibitor LB-4b as a potential anticancer agent. Bioorg Med Chem Lett 23:2512-7 (2013)  
Target
Name:
Aminopeptidase N
Synonyms:
AMPN_PIG AP-M Alanyl aminopeptidase Aminopeptidase N (APN) Microsomal aminopeptidase pAPN
Type:
Protein
Mol. Mass.:
108810.25
Organism:
Sus scrofa (Pig)
Description:
P15145
Residue:
963
  
Inhibitor
Name:
BDBM23971
Synonyms:
(2S)-2-[(2S,3R)-3-amino-2-hydroxy-4-phenylbutanamido]-4-methylpentanoic acid CHEMBL29292 | Ubenimex
Type:
Small organic molecule
Emp. Form.:
C16H24N2O4
Mol. Mass.:
308.3728
SMILES:
CC(C)C[C@H](NC(=O)[C@@H](O)[C@H](N)Cc1ccccc1)C(O)=O
: