Target
Catenin beta-1
Ligand
BDBM50436058
Substrate
Meas. Tech.
ChEMBL_968782 (CHEMBL2399335)
Kd
450±n/a nM
Citation
 Hahne, GGrossmann, TN Direct targeting of฿-catenin: Inhibition of protein-protein interactions for the inactivation of Wnt signaling. Bioorg Med Chem 21:4020-6 (2013)  
Target
Name:
Catenin beta-1
Synonyms:
CTNB1_HUMAN CTNNB1
Type:
PROTEIN
Mol. Mass.:
85484.08
Organism:
Homo sapiens (Human)
Description:
ChEMBL_1504364
Residue:
781
  
Inhibitor
Name:
BDBM50436058
Synonyms:
CHEMBL254381 US9738628, Compound PNU-74654
Type:
Small organic molecule
Emp. Form.:
C19H16N2O3
Mol. Mass.:
320.3419
SMILES:
Cc1ccc(\C=N\NC(=O)c2ccccc2Oc2ccccc2)o1
: