Target
Adenosine receptor A3
Ligand
BDBM50437188
Substrate
Meas. Tech.
ChEMBL_970296 (CHEMBL2403962)
EC50
13±n/a nM
Citation
 Paoletta, STosh, DKFinley, AGizewski, ETMoss, SMGao, ZGAuchampach, JASalvemini, DJacobson, KA Rational design of sulfonated A3 adenosine receptor-selective nucleosides as pharmacological tools to study chronic neuropathic pain. J Med Chem 56:5949-63 (2014)  
Target
Name:
Adenosine receptor A3
Synonyms:
A3AR Adenosine A3 receptor Gpcr2
Type:
PROTEIN
Mol. Mass.:
36460.91
Organism:
Mus musculus
Description:
ChEMBL_1515686
Residue:
319
  
Inhibitor
Name:
BDBM50437188
Synonyms:
CHEMBL2401954
Type:
Small organic molecule
Emp. Form.:
C28H25ClN6O6S
Mol. Mass.:
609.053
SMILES:
CNC(=O)[C@@]12C[C@@H]1[C@H]([C@H](O)[C@@H]2O)n1cnc2c(NCc3cccc(Cl)c3)nc(nc12)C#Cc1ccc(cc1)S(O)(=O)=O
: