Target
Progesterone receptor
Ligand
BDBM50228080
Substrate
Meas. Tech.
ChEMBL_974212 (CHEMBL2411346)
EC50
>20000±n/a nM
Citation
 Yang, CShen, HCWu, ZChu, HDCox, JMBalsells, JCrespo, ABrown, PZamlynny, BWiltsie, JClemas, JGibson, JContino, LLisnock, JZhou, GGarcia-Calvo, MBateman, TXu, LTong, XCrook, MSinclair, P Discovery of novel oxazolidinedione derivatives as potent and selective mineralocorticoid receptor antagonists. Bioorg Med Chem Lett 23:4388-92 (2013)  
Target
Name:
Progesterone receptor
Synonyms:
NR3C3 PGR PRGR_HUMAN | progesterone
Type:
Protein
Mol. Mass.:
98979.52
Organism:
Homo sapiens (Human)
Description:
P06401
Residue:
933
  
Inhibitor
Name:
BDBM50228080
Synonyms:
2',15'-dimethyl-5,5'-dioxo-(9'R)-spiro[tetrahydrofuran-2,14'-tetracyclo[8.7.0.02,7.011,15]heptadec-6'-ene]-9-yl ethanethioate 2',15'-dimethyl-5,5'-dioxospiro[tetrahydrofuran-2,14'-tetracyclo[8.7.0.02,7.011,15]heptadec-6'-ene]-9-yl ethanethioate(Spiranolactone) CHEMBL1393 SPIRONOLACTONE cid_5833
Type:
Small organic molecule
Emp. Form.:
C24H32O4S
Mol. Mass.:
416.573
SMILES:
CC(=O)S[C@@H]1CC2=CC(=O)CC[C@]2(C)[C@H]2CC[C@@]3(C)[C@@H](CC[C@@]33CCC(=O)O3)[C@H]12
: