Target
Alkaline phosphatase, tissue-nonspecific isozyme
Ligand
BDBM50437940
Substrate
Meas. Tech.
ChEMBL_972806 (CHEMBL2411274)
Ki
44000±n/a nM
Citation
 al-Rashida, MRaza, RAbbas, GShah, MSKostakis, GELecka, JSévigny, JMuddassar, MPapatriantafyllopoulou, CIqbal, J Identification of novel chromone based sulfonamides as highly potent and selective inhibitors of alkaline phosphatases. Eur J Med Chem 66:438-49 (2013)  
Target
Name:
Alkaline phosphatase, tissue-nonspecific isozyme
Synonyms:
ALPL Alkaline phosphatase liver/bone/kidney isozyme PPBT_BOVIN Tissue non-specific alkaline phosphatase (TNAP)
Type:
Protein
Mol. Mass.:
57195.60
Organism:
Bos taurus (Cattle)
Description:
P09487
Residue:
524
  
Inhibitor
Name:
BDBM50437940
Synonyms:
CHEMBL1814398
Type:
Small organic molecule
Emp. Form.:
C18H17BrN2O5S
Mol. Mass.:
453.307
SMILES:
CCOC1Oc2ccc(Br)cc2C(=O)C1=CNc1cccc(c1)S(N)(=O)=O
: