Target
Intestinal-type alkaline phosphatase
Ligand
BDBM50437929
Substrate
Meas. Tech.
ChEMBL_972808 (CHEMBL2411276)
Ki
410±n/a nM
Citation
 al-Rashida, MRaza, RAbbas, GShah, MSKostakis, GELecka, JSévigny, JMuddassar, MPapatriantafyllopoulou, CIqbal, J Identification of novel chromone based sulfonamides as highly potent and selective inhibitors of alkaline phosphatases. Eur J Med Chem 66:438-49 (2013)  
Target
Name:
Intestinal-type alkaline phosphatase
Synonyms:
ALPI Intestinal alkaline phosphatase (IAP) PPBI_BOVIN
Type:
Protein
Mol. Mass.:
57094.82
Organism:
Bos taurus (Cattle)
Description:
P19111
Residue:
533
  
Inhibitor
Name:
BDBM50437929
Synonyms:
CHEMBL2408560
Type:
Small organic molecule
Emp. Form.:
C23H21N3O5S
Mol. Mass.:
451.495
SMILES:
CCOC1Oc2ccccc2C(=O)C1=CNc1ccc(cc1)S(=O)(=O)Nc1ccccn1
: