Target
Acetylpolyamine amidohydrolase
Ligand
BDBM50438386
Substrate
Meas. Tech.
ChEMBL_975718 (CHEMBL2415216)
IC50
26000±n/a nM
Citation
 Decroos, CBowman, CMChristianson, DW Synthesis and evaluation of N8-acetylspermidine analogues as inhibitors of bacterial acetylpolyamine amidohydrolase. Bioorg Med Chem 21:4530-40 (2013)  
Target
Name:
Acetylpolyamine amidohydrolase
Synonyms:
APAH_MYCRA Acetylpolyamine aminohydrolase aphA
Type:
Protein
Mol. Mass.:
36324.64
Organism:
Mycoplana ramosa (Gram-negative bacterium)
Description:
Residue:
341
  
Inhibitor
Name:
BDBM50438386
Synonyms:
CHEMBL2414004
Type:
Small organic molecule
Emp. Form.:
C8H20N2S
Mol. Mass.:
176.323
SMILES:
NCCCNCCCCCS
: