Target
Acetylpolyamine amidohydrolase
Ligand
BDBM50405937
Substrate
Meas. Tech.
ChEMBL_975718 (CHEMBL2415216)
IC50
160000±n/a nM
Citation
 Decroos, CBowman, CMChristianson, DW Synthesis and evaluation of N8-acetylspermidine analogues as inhibitors of bacterial acetylpolyamine amidohydrolase. Bioorg Med Chem 21:4530-40 (2013)  
Target
Name:
Acetylpolyamine amidohydrolase
Synonyms:
APAH_MYCRA Acetylpolyamine aminohydrolase aphA
Type:
Protein
Mol. Mass.:
36324.64
Organism:
Mycoplana ramosa (Gram-negative bacterium)
Description:
Residue:
341
  
Inhibitor
Name:
BDBM50405937
Synonyms:
CHEMBL173782
Type:
Small organic molecule
Emp. Form.:
C10H22N2O
Mol. Mass.:
186.2945
SMILES:
CC(=O)CCCCCNCCCN
: