Target
Voltage-dependent N-type calcium channel subunit alpha-1B
Ligand
BDBM50438747
Substrate
Meas. Tech.
ChEMBL_976391 (CHEMBL2415333)
IC50
10400±n/a nM
Citation
 Beebe, XYeung, CMDarczak, DShekhar, SVortherms, TAMiller, LMilicic, ISwensen, AMZhu, CZBanfor, PWetter, JMMarsh, KCJarvis, MFScott, VESchrimpf, MRLee, CH Synthesis and SAR of 4-aminocyclopentapyrrolidines as orally active N-type calcium channel inhibitors for inflammatory and neuropathic pain. Bioorg Med Chem Lett 23:4857-61 (2013)  
Target
Name:
Voltage-dependent N-type calcium channel subunit alpha-1B
Synonyms:
BIII Cach5 Cacnl1a5 Voltage-gated calcium channel subunit alpha Cav2.2 | calcium channel III
Type:
Enzyme Catalytic Domain
Mol. Mass.:
262310.63
Organism:
Rattus norvegicus (Rat)
Description:
Q02294
Residue:
2336
  
Inhibitor
Name:
BDBM50438747
Synonyms:
CHEMBL2414787
Type:
Small organic molecule
Emp. Form.:
C24H36F3N3O3S
Mol. Mass.:
503.621
SMILES:
CC(C)N[C@@H](CC(C)(C)C)C(=O)N[C@H]1CC[C@@H]2CN(C[C@H]12)S(=O)(=O)c1ccc(cc1)C(F)(F)F
: