Target
Lysosomal acid glucosylceramidase
Ligand
BDBM18358
Substrate
Meas. Tech.
ChEMBL_976486 (CHEMBL2416651)
Ki
1300±n/a nM
Citation
 Cheng, WCWeng, CYYun, WYChang, SYLin, YCTsai, FJHuang, FYChen, YR Rapid modifications of N-substitution in iminosugars: development of newß-glucocerebrosidase inhibitors and pharmacological chaperones for Gaucher disease. Bioorg Med Chem 21:5021-8 (2013)  
Target
Name:
Lysosomal acid glucosylceramidase
Synonyms:
Acid beta-glucosidase Beta-glucocerebrosidase D-glucosyl-N-acylsphingosine glucohydrolase GBA1 GC GLUC Glucosylceramidase (GBA) Glucosylceramidase precursor (Beta-glucocerebrosidase) (Acid beta-glucosidase) (D-glucosyl-N-acylsphingosine glucohydrolase) (Alglucerase) (Imiglucerase) beta-glucocerebrosidase (GCase)
Type:
Enzyme
Mol. Mass.:
59724.64
Organism:
Homo sapiens (Human)
Description:
The beta-Glu activity was measured with commercially available beta-glucocerebrosidase (Ceredase) as the enzyme source.
Residue:
536
  
Inhibitor
Name:
BDBM18358
Synonyms:
(2R,3R,4R,5S)-2-(hydroxymethyl)-1-nonylpiperidine-3,4,5-triol | N-Nonyl-DNJ
Type:
Small organic molecule
Emp. Form.:
C15H31NO4
Mol. Mass.:
289.4109
SMILES:
CCCCCCCCCN1C[C@H](O)[C@@H](O)[C@H](O)[C@H]1CO
: