Target
Lysosomal acid glucosylceramidase
Ligand
BDBM50438752
Substrate
Meas. Tech.
ChEMBL_976486 (CHEMBL2416651)
Ki
400±n/a nM
Citation
 Cheng, WCWeng, CYYun, WYChang, SYLin, YCTsai, FJHuang, FYChen, YR Rapid modifications of N-substitution in iminosugars: development of newß-glucocerebrosidase inhibitors and pharmacological chaperones for Gaucher disease. Bioorg Med Chem 21:5021-8 (2013)  
Target
Name:
Lysosomal acid glucosylceramidase
Synonyms:
Acid beta-glucosidase Beta-glucocerebrosidase D-glucosyl-N-acylsphingosine glucohydrolase GBA1 GC GLUC Glucosylceramidase (GBA) Glucosylceramidase precursor (Beta-glucocerebrosidase) (Acid beta-glucosidase) (D-glucosyl-N-acylsphingosine glucohydrolase) (Alglucerase) (Imiglucerase) beta-glucocerebrosidase (GCase)
Type:
Enzyme
Mol. Mass.:
59724.64
Organism:
Homo sapiens (Human)
Description:
The beta-Glu activity was measured with commercially available beta-glucocerebrosidase (Ceredase) as the enzyme source.
Residue:
536
  
Inhibitor
Name:
BDBM50438752
Synonyms:
CHEMBL2414882
Type:
Small organic molecule
Emp. Form.:
C31H38N2O5
Mol. Mass.:
518.6438
SMILES:
OC[C@@H]1[C@@H](O)[C@H](O)[C@@H](O)CN1CCCCNC(=O)CC(c1ccccc1)(c1ccccc1)c1ccccc1
: