Target
Arginase-1
Ligand
BDBM50439237
Substrate
Meas. Tech.
ChEMBL_978893 (CHEMBL2423684)
IC50
200±n/a nM
Citation
 Golebiowski, AWhitehouse, DBeckett, RPVan Zandt, MJi, MKRyder, TRJagdmann, EAndreoli, MLee, YSheeler, RConway, BOlczak, JMazur, MCzestkowski, WPiotrowska, WCousido-Siah, ARuiz, FXMitschler, APodjarny, ASchroeter, H Synthesis of quaternarya-amino acid-based arginase inhibitors via the Ugi reaction. Bioorg Med Chem Lett 23:4837-41 (2013)  
Target
Name:
Arginase-1
Synonyms:
ARG1 Liver-type arginase | Type I arginase
Type:
PROTEIN
Mol. Mass.:
34737.53
Organism:
Homo sapiens (Human)
Description:
ChEMBL_978893
Residue:
322
  
Inhibitor
Name:
BDBM50439237
Synonyms:
CHEMBL2418996
Type:
Small organic molecule
Emp. Form.:
C18H27BCl2N2O4
Mol. Mass.:
417.135
SMILES:
NC(CCCCB(O)O)(C1CCN(Cc2ccc(Cl)c(Cl)c2)CC1)C(O)=O
: