Target
Cytochrome P450 2C9
Ligand
BDBM50440017
Substrate
Meas. Tech.
ChEMBL_982266 (CHEMBL2429333)
IC50
39±n/a nM
Citation
 Palmer, WSAlam, MArzeno, HBChang, KCDunn, JPGoldstein, DMGong, LGoyal, BHermann, JCHogg, JHHsieh, GJahangir, AJanson, CJin, SUrsula Kammlott, RKuglstatter, ALukacs, CMichoud, CNiu, LReuter, DCShao, ASilva, TTrejo-Martin, TAStein, KTan, YCTivitmahaisoon, PTran, PWagner, PWeller, PWu, SY Development of amino-pyrimidine inhibitors of c-Jun N-terminal kinase (JNK): kinase profiling guided optimization of a 1,2,3-benzotriazole lead. Bioorg Med Chem Lett 23:1486-92 (2013)  
Target
Name:
Cytochrome P450 2C9
Synonyms:
(R)-limonene 6-monooxygenase CP2C9_HUMAN CYP2C9 Cytochrome P450 2C9 (CYP2C9 ) P-450MP P450 PB-1 | S-mephenytoin 4-hydroxylase
Type:
Enzyme
Mol. Mass.:
55636.33
Organism:
Homo sapiens (Human)
Description:
P11712
Residue:
490
  
Inhibitor
Name:
BDBM50440017
Synonyms:
CHEMBL2425651
Type:
Small organic molecule
Emp. Form.:
C18H21N7O
Mol. Mass.:
351.4056
SMILES:
CC(=O)N[C@H]1CC[C@@H](CC1)Nc1nccc(n1)-n1nnc2ccccc12
: