Target
G-protein coupled receptor 35
Ligand
BDBM50436023
Substrate
Meas. Tech.
ChEMBL_982934 (CHEMBL2429574)
Ki
250±n/a nM
Citation
 Thimm, DFunke, MMeyer, AMüller, CE 6-Bromo-8-(4-[(3)H]methoxybenzamido)-4-oxo-4H-chromene-2-carboxylic Acid: a powerful tool for studying orphan G protein-coupled receptor GPR35. J Med Chem 56:7084-99 (2013)  
Target
Name:
G-protein coupled receptor 35
Synonyms:
G protein-coupled receptor 35 GPR35_HUMAN
Type:
Enzyme Catalytic Domain
Mol. Mass.:
34085.57
Organism:
Homo sapiens (Human)
Description:
gi_33695097
Residue:
309
  
Inhibitor
Name:
BDBM50436023
Synonyms:
CHEMBL2392165
Type:
Small organic molecule
Emp. Form.:
C18H12ClNO5
Mol. Mass.:
357.745
SMILES:
Cc1cccc(c1)C(=O)Nc1cc(Cl)cc2c1oc(cc2=O)C(O)=O
: