Target
Muscarinic acetylcholine receptor M2
Ligand
BDBM50440253
Substrate
Meas. Tech.
ChEMBL_982012 (CHEMBL2428367)
Ki
>67608±n/a nM
Citation
 McClure, KFJackson, MCameron, KOKung, DWPerry, DAOrr, STZhang, YKohrt, JTu, MGao, HFernando, DJones, RErasga, NWang, GPolivkova, JJiao, WSwartz, RUeno, HBhattacharya, SKStock, IAVarma, SBagdasarian, VPerez, SKelly-Sullivan, DWang, RKong, JCornelius, PMichael, LLee, EJanssen, ASteyn, SJLapham, KGoosen, T Identification of potent, selective, CNS-targeted inverse agonists of the ghrelin receptor. Bioorg Med Chem Lett 23:5410-4 (2013)  
Target
Name:
Muscarinic acetylcholine receptor M2
Synonyms:
ACM2_HUMAN Cholinergic, muscarinic M2 Muscarinic acetylcholine receptor M2 and M5 | RecName: Full=Muscarinic acetylcholine receptor M2
Type:
GPCR
Mol. Mass.:
51730.61
Organism:
Homo sapiens (Human)
Description:
P08172
Residue:
466
  
Inhibitor
Name:
BDBM50440253
Synonyms:
CHEMBL2426685
Type:
Small organic molecule
Emp. Form.:
C30H35N5O2
Mol. Mass.:
497.6312
SMILES:
CCc1cnc(nc1)-c1ccc2[C@@H](CCc2c1)N1CC2(C1)CCN(CC2)C(=O)Cc1ccc(OC)cn1
: