Target
Lysine-specific demethylase 4C
Ligand
BDBM26106
Substrate
Meas. Tech.
ChEMBL_982484 (CHEMBL2427610)
IC50
>250000±n/a nM
Citation
 Suzuki, TOzasa, HItoh, YZhan, PSawada, HMino, KWalport, LOhkubo, RKawamura, AYonezawa, MTsukada, YTumber, ANakagawa, HHasegawa, MSasaki, RMizukami, TSchofield, CJMiyata, N Identification of the KDM2/7 histone lysine demethylase subfamily inhibitor and its antiproliferative activity. J Med Chem 56:7222-31 (2013)  
Target
Name:
Lysine-specific demethylase 4C
Synonyms:
GASC-1 protein Gene amplified in squamous cell carcinoma 1 protein JMJD2C Jumonji domain-containing protein 2C KDM4C_HUMAN | KIAA0780
Type:
Protein
Mol. Mass.:
119979.01
Organism:
Homo sapiens (Human)
Description:
Q9H3R0
Residue:
1056
  
Inhibitor
Name:
BDBM26106
Synonyms:
CHEMBL90852 NOG [(carboxymethyl)carbamoyl]formic acid
Type:
Small organic molecule
Emp. Form.:
C4H5NO5
Mol. Mass.:
147.0862
SMILES:
OC(=O)CNC(=O)C(O)=O
: