Target
DNA topoisomerase 4 subunit A/B
Ligand
BDBM21690
Substrate
Meas. Tech.
ChEMBL_982977 (CHEMBL2427061)
IC50
8000±n/a nM
Citation
 Surivet, JPZumbrunn, CRueedi, GHubschwerlen, CBur, DBruyère, TLocher, HRitz, DKeck, WSeiler, PKohl, CGauvin, JCMirre, AKaegi, VDos Santos, MGaertner, MDelers, JEnderlin-Paput, MBoehme, M Design, synthesis, and characterization of novel tetrahydropyran-based bacterial topoisomerase inhibitors with potent anti-gram-positive activity. J Med Chem 56:7396-415 (2013)  
Target
Name:
DNA topoisomerase 4 subunit A/B
Synonyms:
Topoisomerase IV
Type:
Mol. Mass.:
Description:
ASSAY_ID of ChEMBL is 2012758
Components:
This complex has 2 components.
Component 1
Name:
DNA topoisomerase 4 subunit A
Synonyms:
PARC_STAAU grlA | parC
Type:
PROTEIN
Mol. Mass.:
91040.14
Organism:
Staphylococcus aureus
Description:
ChEMBL_340188
Residue:
800
  
Component 2
Name:
DNA topoisomerase 4 subunit B
Synonyms:
DNA topoisomerase 4 subunit B PARE_STAA8 grlB | parE
Type:
Enzyme
Mol. Mass.:
74365.92
Organism:
Staphylococcus aureus
Description:
Q2FYS5
Residue:
663
  
Inhibitor
Name:
BDBM21690
Synonyms:
1-cyclopropyl-6-fluoro-4-oxo-7-(piperazin-1-yl)-1,4-dihydroquinoline-3-carboxylic acid Bay 09867 Ciprinol Ciprofloxacin US9138393, Ciprofloxacin HCl | US9144538, Ciprofloxacin HCl
Type:
Small organic molecule
Emp. Form.:
C17H18FN3O3
Mol. Mass.:
331.3415
SMILES:
OC(=O)c1cn(C2CC2)c2cc(N3CCNCC3)c(F)cc2c1=O
: