Target
MBT domain-containing protein 1
Ligand
BDBM50440600
Substrate
Meas. Tech.
ChEMBL_983404 (CHEMBL2429074)
IC50
5400±n/a nM
Citation
 James, LIKorboukh, VKKrichevsky, LBaughman, BMHerold, JMNorris, JLJin, JKireev, DBJanzen, WPArrowsmith, CHFrye, SV Small-molecule ligands of methyl-lysine binding proteins: optimization of selectivity for L3MBTL3. J Med Chem 56:7358-71 (2013)  
Target
Name:
MBT domain-containing protein 1
Synonyms:
MBT domain-containing protein 1 MBTD1 | MBTD1_HUMAN
Type:
Protein
Mol. Mass.:
70557.67
Organism:
Homo sapiens (Human)
Description:
Residue:
628
  
Inhibitor
Name:
BDBM50440600
Synonyms:
CHEMBL2426481
Type:
Small organic molecule
Emp. Form.:
C25H38N4O3S
Mol. Mass.:
474.659
SMILES:
O=C(N1CCC(CC1)N1CCCC1)c1ccc(cc1)S(=O)(=O)N1CCC(CC1)N1CCCC1
: