Target
Lethal(3)malignant brain tumor-like protein 3
Ligand
BDBM50440600
Substrate
Meas. Tech.
ChEMBL_983410 (CHEMBL2429080)
IC50
97±n/a nM
Citation
 James, LIKorboukh, VKKrichevsky, LBaughman, BMHerold, JMNorris, JLJin, JKireev, DBJanzen, WPArrowsmith, CHFrye, SV Small-molecule ligands of methyl-lysine binding proteins: optimization of selectivity for L3MBTL3. J Med Chem 56:7358-71 (2013)  
Target
Name:
Lethal(3)malignant brain tumor-like protein 3
Synonyms:
H-l(3)mbt-like protein 3 L(3)mbt-like protein 3 LMBL3_HUMAN Lethal(3)malignant brain tumor-like protein 3 (L3MBTL3) MBT1
Type:
Protein
Mol. Mass.:
88334.17
Organism:
Homo sapiens (Human)
Description:
Residue:
780
  
Inhibitor
Name:
BDBM50440600
Synonyms:
CHEMBL2426481
Type:
Small organic molecule
Emp. Form.:
C25H38N4O3S
Mol. Mass.:
474.659
SMILES:
O=C(N1CCC(CC1)N1CCCC1)c1ccc(cc1)S(=O)(=O)N1CCC(CC1)N1CCCC1
: