Target
PHD finger protein 23
Ligand
BDBM50440575
Substrate
Meas. Tech.
ChEMBL_983401 (CHEMBL2429071)
IC50
>10000±n/a nM
Citation
 James, LIKorboukh, VKKrichevsky, LBaughman, BMHerold, JMNorris, JLJin, JKireev, DBJanzen, WPArrowsmith, CHFrye, SV Small-molecule ligands of methyl-lysine binding proteins: optimization of selectivity for L3MBTL3. J Med Chem 56:7358-71 (2013)  
Target
Name:
PHD finger protein 23
Synonyms:
PDH-containing protein JUNE-1 PHD finger protein 23 (PHF23) PHF23_HUMAN
Type:
Protein
Mol. Mass.:
43813.67
Organism:
Homo sapiens (Human)
Description:
Residue:
403
  
Inhibitor
Name:
BDBM50440575
Synonyms:
CHEMBL2426470
Type:
Small organic molecule
Emp. Form.:
C30H42N4O2
Mol. Mass.:
490.6801
SMILES:
O=C(N1CC2CCC(C1)C2N1CCCC1)c1ccc(cc1)C(=O)N1CC2CCC(C1)C2N1CCCC1
: