Target
E3 ubiquitin-protein ligase UHRF1
Ligand
BDBM50440607
Substrate
Meas. Tech.
ChEMBL_983403 (CHEMBL2429073)
IC50
>10000±n/a nM
Citation
 James, LIKorboukh, VKKrichevsky, LBaughman, BMHerold, JMNorris, JLJin, JKireev, DBJanzen, WPArrowsmith, CHFrye, SV Small-molecule ligands of methyl-lysine binding proteins: optimization of selectivity for L3MBTL3. J Med Chem 56:7358-71 (2013)  
Target
Name:
E3 ubiquitin-protein ligase UHRF1
Synonyms:
6.3.2.- E3 ubiquitin-protein ligase UHRF1 ICBP90 NP95 Nuclear zinc finger protein Np95 RNF106 UHRF1 Ubiquitin-like PHD and RING finger domain-containing protein 1 hNp95 | hUHRF1
Type:
Protein
Mol. Mass.:
89822.48
Organism:
Homo sapiens (Human)
Description:
Residue:
793
  
Inhibitor
Name:
BDBM50440607
Synonyms:
CHEMBL2426375
Type:
Small organic molecule
Emp. Form.:
C27H34N4O2
Mol. Mass.:
446.5845
SMILES:
CCN1Cc2ccc(NC(=O)c3ccc(cc3)C(=O)N3CCC(CC3)C3CCCN3)cc2C1
: