Target
TP53-binding protein 1
Ligand
BDBM50440598
Substrate
Meas. Tech.
ChEMBL_983402 (CHEMBL2429072)
IC50
>10000±n/a nM
Citation
 James, LIKorboukh, VKKrichevsky, LBaughman, BMHerold, JMNorris, JLJin, JKireev, DBJanzen, WPArrowsmith, CHFrye, SV Small-molecule ligands of methyl-lysine binding proteins: optimization of selectivity for L3MBTL3. J Med Chem 56:7358-71 (2013)  
Target
Name:
TP53-binding protein 1
Synonyms:
53BP1 TP53BP1 Tumor suppressor p53-binding protein 1 p53BP1
Type:
PROTEIN
Mol. Mass.:
213442.98
Organism:
Homo sapiens (Human)
Description:
ChEMBL_107658
Residue:
1972
  
Inhibitor
Name:
BDBM50440598
Synonyms:
CHEMBL2426483
Type:
Small organic molecule
Emp. Form.:
C26H40N4O
Mol. Mass.:
424.622
SMILES:
O=C(N1CCC(CC1)N1CCCC1)c1ccc(CN2CCC(CC2)N2CCCC2)cc1
: