Target
Calcitonin gene-related peptide type 1 receptor
Ligand
BDBM50440786
Substrate
Meas. Tech.
ChEMBL_986467 (CHEMBL2434392)
Ki
0.045000±n/a nM
Citation
 Bell, IMGallicchio, SNStump, CABruno, JGFan, HGantert, LTHostetler, EDKemmerer, ALMcWherter, MMoore, ELMosser, SDPurcell, MLRiffel, KSalvatore, CASanabria-Bohórquez, SStaas, DDWhite, RBWilliams, MZartman, CBCook, JJHargreaves, RJKane, SAGraham, SLSelnick, HG [(11)C]MK-4232: The First Positron Emission Tomography Tracer for the Calcitonin Gene-Related Peptide Receptor. ACS Med Chem Lett 4:863-8 (2013)  
Target
Name:
Calcitonin gene-related peptide type 1 receptor
Synonyms:
Adrenomedullin receptor AM1; CALCRL/RAMP2 CALRL_HUMAN CGRP type 1 receptor mRNA Calcitonin gene-related peptide (CGRP) receptor Calcitonin receptor-like receptor Human CL receptor
Type:
Enzyme Catalytic Domain
Mol. Mass.:
52980.45
Organism:
Homo sapiens (Human)
Description:
Q16602
Residue:
461
  
Inhibitor
Name:
BDBM50440786
Synonyms:
CHEMBL2431251
Type:
Small organic molecule
Emp. Form.:
C33H35F2N5O2
Mol. Mass.:
571.6601
SMILES:
CN1C[C@](C)(N(CCCc2cnc3C[C@]4(Cc3c2)C(=O)Nc2ncccc42)C(=O)C11CCCC1)c1cc(F)cc(F)c1
: