Target
Tyrosine-protein kinase ITK/TSK
Ligand
BDBM50442158
Substrate
Meas. Tech.
ChEMBL_993112 (CHEMBL2446687)
Ki
3981±n/a nM
Citation
 Alder, CMAmbler, MCampbell, AJChampigny, ACDeakin, AMHarling, JDHarris, CALongstaff, TLynn, SMaxwell, ACMooney, CJScullion, CSingh, OMSmith, IESomers, DOTame, CJWayne, GWilson, CWoolven, JM Identification of a Novel and Selective Series of Itk Inhibitors via a Template-Hopping Strategy. ACS Med Chem Lett 4:948-52 (2013)  
Target
Name:
Tyrosine-protein kinase ITK/TSK
Synonyms:
EMT ITK_HUMAN LYK Tyrosine-protein kinase ITK Tyrosine-protein kinase Lyk
Type:
Protein
Mol. Mass.:
71839.20
Organism:
Homo sapiens (Human)
Description:
Q08881
Residue:
620
  
Inhibitor
Name:
BDBM50442158
Synonyms:
CHEMBL2441111
Type:
Small organic molecule
Emp. Form.:
C24H21F3N6O2S
Mol. Mass.:
514.523
SMILES:
COc1ccc2nc(Nc3cc(nc(n3)N3CCC[C@H]3C(N)=O)C(F)(F)c3ccc(F)cc3)sc2c1
: