Target
2-acylglycerol O-acyltransferase 2
Ligand
BDBM50442178
Substrate
Meas. Tech.
ChEMBL_991050 (CHEMBL2446069)
IC50
15±n/a nM
Citation
 Abdel-Magid, AF Fighting Obesity and Metabolic Disorders with MGAT-2 Inhibitors. ACS Med Chem Lett 4:898-9 (2013)  
Target
Name:
2-acylglycerol O-acyltransferase 2
Synonyms:
2-acylglycerol O-acyltransferase 2 Acyl-CoA:monoacylglycerol acyltransferase 2 (MOGAT2) DGAT2L5 Diacylglycerol acyltransferase 2-like protein 5 MOGAT2 Monoacylglycerol Acyltransferase 2 (MGAT2) hDC5 | hMGAT2
Type:
Enzyme
Mol. Mass.:
38210.80
Organism:
Homo sapiens (Human)
Description:
Q3SYC2
Residue:
334
  
Inhibitor
Name:
BDBM50442178
Synonyms:
CHEMBL2441600 | US9187424, 124
Type:
Small organic molecule
Emp. Form.:
C31H28F6N2O4
Mol. Mass.:
606.5554
SMILES:
COc1ccc(NC(=O)C2=C(CC(NC2=O)(c2ccc(OCCCC(F)(F)F)cc2)C(F)(F)F)c2ccc(C)cc2)cc1
: