Target
Aldo-keto reductase family 1 member B1
Ligand
BDBM50442505
Substrate
Meas. Tech.
ChEMBL_990161 (CHEMBL2444356)
IC50
12±n/a nM
Citation
 Endo, SHu, DSuyama, MMatsunaga, TSugimoto, KMatsuya, YEl-Kabbani, OKuwata, KHara, AKitade, YToyooka, N Synthesis and structure-activity relationship of 2-phenyliminochromene derivatives as inhibitors for aldo-keto reductase (AKR) 1B10. Bioorg Med Chem 21:6378-84 (2013)  
Target
Name:
Aldo-keto reductase family 1 member B1
Synonyms:
AKR1B1 ALDR_HUMAN AR Aldose Reductase (ALR2) Aldose reductase (AR)
Type:
Protein
Mol. Mass.:
35855.50
Organism:
Homo sapiens (Human)
Description:
P15121. 4LAU; 2IKI; 4LB4; 2FZD; 2FZ8; 1US0
Residue:
316
  
Inhibitor
Name:
BDBM50442505
Synonyms:
CHEMBL2440426
Type:
Small organic molecule
Emp. Form.:
C21H14IN3O3
Mol. Mass.:
483.2586
SMILES:
Oc1ccc2cc(C(=O)Nc3ccccn3)\c(=N\c3ccc(I)cc3)oc2c1
: