Target
Solute carrier organic anion transporter family member 1B3
Ligand
BDBM54988
Substrate
Meas. Tech.
ChEMBL_1265866 (CHEMBL3039492)
IC50
2951±n/a nM
Citation
 De Bruyn, Tvan Westen, GJIjzerman, APStieger, Bde Witte, PAugustijns, PFAnnaert, PP Structure-based identification of OATP1B1/3 inhibitors. Mol Pharmacol 83:1257-67 (2013)  
Target
Name:
Solute carrier organic anion transporter family member 1B3
Synonyms:
LST2 OATP8 SLC21A8 SO1B3_HUMAN Solute carrier organic anion transporter family member 1B3 (OATP1B3)
Type:
Protein
Mol. Mass.:
77425.75
Organism:
Homo sapiens (Human)
Description:
Q9NPD5
Residue:
702
  
Inhibitor
Name:
BDBM54988
Synonyms:
BETA CAROTENE SMR000112037 cid_5280489
Type:
Small organic molecule
Emp. Form.:
C40H56
Mol. Mass.:
536.8726
SMILES:
C\C(\C=C\C=C(/C)\C=C\C1=C(C)CCCC1(C)C)=C/C=C/C=C(\C)/C=C/C=C(\C)/C=C/C1=C(C)CCCC1(C)C
: