Target
Solute carrier organic anion transporter family member 1B3
Ligand
BDBM50442874
Substrate
Meas. Tech.
ChEMBL_1265867 (CHEMBL3039493)
Ki
2870±n/a nM
Citation
 De Bruyn, Tvan Westen, GJIjzerman, APStieger, Bde Witte, PAugustijns, PFAnnaert, PP Structure-based identification of OATP1B1/3 inhibitors. Mol Pharmacol 83:1257-67 (2013)  
Target
Name:
Solute carrier organic anion transporter family member 1B3
Synonyms:
LST2 OATP8 SLC21A8 SO1B3_HUMAN Solute carrier organic anion transporter family member 1B3 (OATP1B3)
Type:
Protein
Mol. Mass.:
77425.75
Organism:
Homo sapiens (Human)
Description:
Q9NPD5
Residue:
702
  
Inhibitor
Name:
BDBM50442874
Synonyms:
Conceptrol Emko Intercept Nonoxinol 9 Nonylphenoxypolyethoxyethanol Today | Today Sponge
Type:
Small organic molecule
Emp. Form.:
C33H60O10
Mol. Mass.:
616.8235
SMILES:
CCCCCCCCCc1ccc(OCCOCCOCCOCCOCCOCCOCCOCCOCCO)cc1
: