Target
CREB-binding protein
Ligand
BDBM50443231
Substrate
Meas. Tech.
ChEMBL_1277430 (CHEMBL3089620)
Ki
5120±n/a nM
Citation
 Zhang, GPlotnikov, ANRusinova, EShen, TMorohashi, KJoshua, JZeng, LMujtaba, SOhlmeyer, MZhou, MM Structure-guided design of potent diazobenzene inhibitors for the BET bromodomains. J Med Chem 56:9251-64 (2013)  
Target
Name:
CREB-binding protein
Synonyms:
CBP CREB-binding protein (CBP) CREBBP
Type:
Transcription Coactivator
Mol. Mass.:
265411.66
Organism:
Homo sapiens (Human)
Description:
Q92793
Residue:
2442
  
Inhibitor
Name:
BDBM50443231
Synonyms:
CHEMBL3086884
Type:
Small organic molecule
Emp. Form.:
C19H19N5O3S
Mol. Mass.:
397.451
SMILES:
Cc1cc(N=Nc2ccc(cc2)S(=O)(=O)Nc2ccccn2)c(N)c(C)c1O
: