Target
Proteasome subunit beta type-5
Ligand
BDBM50444463
Substrate
Meas. Tech.
ChEMBL_1277478 (CHEMBL3095801)
EC50
90±n/a nM
Citation
 Blasdel, LKLee, DSun, BMyers, AG (S)-4-Trimethylsilyl-3-butyn-2-ol as an auxiliary for stereocontrolled synthesis of salinosporamide analogs with modifications at positions C2 and C5. Bioorg Med Chem Lett 23:6905-10 (2013)  
Target
Name:
Proteasome subunit beta type-5
Synonyms:
20S proteasome chymotrypsin-like LMPX PSB5_HUMAN Proteasome Macropain subunit MB1 X
Type:
Protein
Mol. Mass.:
28480.96
Organism:
Homo sapiens (Human)
Description:
Residue:
263
  
Inhibitor
Name:
BDBM50444463
Synonyms:
CHEMBL3092608
Type:
Small organic molecule
Emp. Form.:
C16H24ClNO4
Mol. Mass.:
329.819
SMILES:
C[C@@]12OC(=O)[C@@]1(NC(=O)[C@@H]2CCCCl)[C@@H](O)C1CCCCC1
: