Target
DNA ligase
Ligand
BDBM50444676
Substrate
Meas. Tech.
ChEMBL_1281598 (CHEMBL3102283)
IC50
430±n/a nM
Citation
 Murphy-Benenato, KWang, HMcGuire, HMDavis, HEGao, NPrince, DBJahic, HStokes, SSBoriack-Sjodin, PA Identification through structure-based methods of a bacterial NAD(+)-dependent DNA ligase inhibitor that avoids known resistance mutations. Bioorg Med Chem Lett 24:360-6 (2013)  
Target
Name:
DNA ligase
Synonyms:
DNLJ_STAAU lig | ligA
Type:
PROTEIN
Mol. Mass.:
75059.93
Organism:
Staphylococcus aureus
Description:
ChEMBL_1281598
Residue:
667
  
Inhibitor
Name:
BDBM50444676
Synonyms:
CHEMBL1807815
Type:
Small organic molecule
Emp. Form.:
C15H21N5O5
Mol. Mass.:
351.3577
SMILES:
Nc1nc(OC2CCCC2)nc2n(cnc12)[C@@H]1O[C@H](CO)[C@@H](O)[C@H]1O
: