Target
Low molecular weight phosphotyrosine protein phosphatase
Ligand
BDBM50444697
Substrate
Meas. Tech.
ChEMBL_1281646 (CHEMBL3102583)
IC50
3300±n/a nM
Citation
 Ottanà, RMaccari, RMortier, JCaselli, AAmuso, SCamici, GRotondo, AWolber, GPaoli, P Synthesis, biological activity and structure-activity relationships of new benzoic acid-based protein tyrosine phosphatase inhibitors endowed with insulinomimetic effects in mouse C2C12 skeletal muscle cells. Eur J Med Chem 71:112-27 (2014)  
Target
Name:
Low molecular weight phosphotyrosine protein phosphatase
Synonyms:
3.1.3.2 ACP1 LMW-PTP LMWPTP PPAC_HUMAN low molecular weight phosphotyrosine protein phosphatase isoform c
Type:
Mol. Mass.:
18042.81
Organism:
Homo sapiens (Human)
Description:
P24666
Residue:
158
  
Inhibitor
Name:
BDBM50444697
Synonyms:
CHEMBL3098857
Type:
Small organic molecule
Emp. Form.:
C31H23FN2O4S
Mol. Mass.:
538.589
SMILES:
OC(=O)c1ccc(CN2C(=O)\C(S\C2=N/c2ccccc2)=C\c2ccc(OCc3ccccc3)c(F)c2)cc1
: