Target
5-hydroxytryptamine receptor 3A
Ligand
BDBM50000492
Substrate
Meas. Tech.
ChEMBL_1283847 (CHEMBL3106134)
Ki
0.398000±n/a nM
Citation
 Rajagopalan, RBandyopadhyaya, ARajagopalan, DRRajagopalan, P The synthesis and comparative receptor binding affinities of novel, isomeric pyridoindolobenzazepine scaffolds. Bioorg Med Chem Lett 24:576-9 (2014)  
Target
Name:
5-hydroxytryptamine receptor 3A
Synonyms:
5-HT-3 5-HT3A 5-hydroxytryptamine receptor 3 (5-HT3) 5-hydroxytryptamine receptor 3A (5HT3A) 5HT3R HTR3A Serotonin 3 receptor (5HT3) Serotonin-gated ion channel receptor | Serotonin-gated ion channel receptor 3
Type:
Protein
Mol. Mass.:
55283.27
Organism:
Homo sapiens (Human)
Description:
P46098
Residue:
478
  
Inhibitor
Name:
BDBM50000492
Synonyms:
(zacopride)4-Amino-N-(1-aza-bicyclo[2.2.2]oct-3-yl)-5-chloro-2-methoxy-benzamide 4-Amino-N-(1-aza-bicyclo[2.2.2]oct-3-yl)-5-chloro-2-methoxy-benzamide (Zacopride) CHEMBL18041 ZACOPRIDE ZACOPRIDE,RS | ZACOPRIDE,S
Type:
Small organic molecule
Emp. Form.:
C15H20ClN3O2
Mol. Mass.:
309.791
SMILES:
COc1cc(N)c(Cl)cc1C(=O)NC1CN2CCC1CC2
: