Target
Seed linoleate 13S-lipoxygenase-1
Ligand
BDBM7461
Substrate
Meas. Tech.
ChEMBL_1284051 (CHEMBL3107208)
Ki
19400±n/a nM
Citation
 Ribeiro, DFreitas, MTomé, SMSilva, AMPorto, GCabrita, EJMarques, MMFernandes, E Inhibition of LOX by flavonoids: a structure-activity relationship study. Eur J Med Chem 72:137-45 (2014)  
Target
Name:
Seed linoleate 13S-lipoxygenase-1
Synonyms:
15-LOX 15-lipo-oxygenase (SLO) L-1 LOX1.1 Lipoxygenase (LOX) Lipoxygenase-1 | Seed lipoxygenase-1
Type:
Enzyme
Mol. Mass.:
94365.66
Organism:
Glycine max (soybean)
Description:
Residue:
839
  
Inhibitor
Name:
BDBM7461
Synonyms:
5,7-dihydroxy-2-phenyl-4H-chromen-4-one 5,7-dihydroxyflavone chrysin | cid_5281607
Type:
Small organic molecule
Emp. Form.:
C15H10O4
Mol. Mass.:
254.2375
SMILES:
Oc1cc(O)c2c(c1)oc(cc2=O)-c1ccccc1
: