Target
ATP-dependent 6-phosphofructokinase
Ligand
BDBM50446116
Substrate
Meas. Tech.
ChEMBL_1288119 (CHEMBL3110579)
IC50
2590±n/a nM
Citation
 Brimacombe, KRWalsh, MJLiu, LVásquez-Valdivieso, MGMorgan, HPMcNae, IFothergill-Gilmore, LAMichels, PAAuld, DSSimeonov, AWalkinshaw, MDShen, MBoxer, MB Identification of ML251, a Potent Inhibitor of T. brucei and T. cruzi Phosphofructokinase. ACS Med Chem Lett 5:12-7 (2014)  
Target
Name:
ATP-dependent 6-phosphofructokinase
Synonyms:
6-phospho-1-fructokinase, putative pfk
Type:
PROTEIN
Mol. Mass.:
53581.09
Organism:
Trypanosoma cruzi
Description:
ChEMBL_108019
Residue:
485
  
Inhibitor
Name:
BDBM50446116
Synonyms:
CHEMBL3108843
Type:
Small organic molecule
Emp. Form.:
C18H16ClN3O4S
Mol. Mass.:
405.855
SMILES:
Cc1cc(NS(=O)(=O)c2ccc(NC(=O)Cc3cccc(Cl)c3)cc2)no1
: