Target
ATP-dependent 6-phosphofructokinase
Ligand
BDBM50446101
Substrate
Meas. Tech.
ChEMBL_1288121 (CHEMBL3110581)
IC50
16300±n/a nM
Citation
 Brimacombe, KRWalsh, MJLiu, LVásquez-Valdivieso, MGMorgan, HPMcNae, IFothergill-Gilmore, LAMichels, PAAuld, DSSimeonov, AWalkinshaw, MDShen, MBoxer, MB Identification of ML251, a Potent Inhibitor of T. brucei and T. cruzi Phosphofructokinase. ACS Med Chem Lett 5:12-7 (2014)  
Target
Name:
ATP-dependent 6-phosphofructokinase
Synonyms:
6-phospho-1-fructokinase pfk
Type:
PROTEIN
Mol. Mass.:
53537.94
Organism:
Trypanosoma brucei
Description:
ChEMBL_1288121
Residue:
487
  
Inhibitor
Name:
BDBM50446101
Synonyms:
CHEMBL3108857
Type:
Small organic molecule
Emp. Form.:
C20H16Cl2N2O3S
Mol. Mass.:
435.324
SMILES:
Clc1ccc(CC(=O)Nc2ccc(cc2)S(=O)(=O)Nc2ccccc2)cc1Cl
: