Target
Oxoeicosanoid receptor 1
Ligand
BDBM50446957
Substrate
Meas. Tech.
ChEMBL_1290942 (CHEMBL3118915)
IC50
566±n/a nM
Citation
 Gore, VGravel, SCossette, CPatel, PChourey, SYe, QRokach, JPowell, WS Inhibition of 5-oxo-6,8,11,14-eicosatetraenoic acid-induced activation of neutrophils and eosinophils by novel indole OXE receptor antagonists. J Med Chem 57:364-77 (2014)  
Target
Name:
Oxoeicosanoid receptor 1
Synonyms:
5-oxo-ETE G-protein coupled receptor G-protein coupled receptor R527 GPR170 OXER1_HUMAN TG 1019 | TG1019
Type:
Enzyme Catalytic Domain
Mol. Mass.:
45833.20
Organism:
Homo sapiens (Human)
Description:
TG 1019 0 HUMAN::Q8TDS5
Residue:
423
  
Inhibitor
Name:
BDBM50446957
Synonyms:
CHEMBL3115790
Type:
Small organic molecule
Emp. Form.:
C20H26ClNO3
Mol. Mass.:
363.878
SMILES:
CCCCCCc1c(C(=O)CCCC(O)=O)c2cc(Cl)ccc2n1C
: