Target
Casein kinase II subunit alpha'
Ligand
BDBM50446982
Substrate
Meas. Tech.
ChEMBL_1291436 (CHEMBL3118226)
IC50
2.7±n/a nM
Citation
 Su, QIoannidis, SChuaqui, CAlmeida, LAlimzhanov, MBebernitz, GBell, KBlock, MHoward, THuang, SHuszar, DRead, JARivard Costa, CShi, JSu, MYe, MZinda, M Discovery of 1-methyl-1H-imidazole derivatives as potent Jak2 inhibitors. J Med Chem 57:144-58 (2014)  
Target
Name:
Casein kinase II subunit alpha'
Synonyms:
CK2A2 CSNK2A2 Casein kinase II alpha' Casein kinase II subunit alpha (CSNK2A2)
Type:
Protein
Mol. Mass.:
41223.82
Organism:
Homo sapiens (Human)
Description:
Residue:
350
  
Inhibitor
Name:
BDBM50446982
Synonyms:
CHEMBL3116050
Type:
Small organic molecule
Emp. Form.:
C16H16FN9
Mol. Mass.:
353.3569
SMILES:
C[C@H](Nc1nc(Nc2cn(C)cn2)c2cc[nH]c2n1)c1ncc(F)cn1
: