Target
Tyrosine-protein kinase JAK2
Ligand
BDBM50446983
Substrate
Meas. Tech.
ChEMBL_1291450 (CHEMBL3118240)
IC50
12±n/a nM
Citation
 Su, QIoannidis, SChuaqui, CAlmeida, LAlimzhanov, MBebernitz, GBell, KBlock, MHoward, THuang, SHuszar, DRead, JARivard Costa, CShi, JSu, MYe, MZinda, M Discovery of 1-methyl-1H-imidazole derivatives as potent Jak2 inhibitors. J Med Chem 57:144-58 (2014)  
Target
Name:
Tyrosine-protein kinase JAK2
Synonyms:
JAK-2 JAK2_HUMAN Janus kinase 2 (JAK2) | Janus kinase 2 (a protein tyrosine kinase)
Type:
Protein
Mol. Mass.:
130684.68
Organism:
Homo sapiens (Human)
Description:
O60674
Residue:
1132
  
Inhibitor
Name:
BDBM50446983
Synonyms:
CHEMBL3116065
Type:
Small organic molecule
Emp. Form.:
C17H16FN9
Mol. Mass.:
365.3676
SMILES:
C[C@H](Nc1nc(Nc2cn(C)cn2)c2ccncc2n1)c1ncc(F)cn1
: