Target
Tyrosine-protein kinase JAK2
Ligand
BDBM50446982
Substrate
Meas. Tech.
ChEMBL_1291226 (CHEMBL3117011)
IC50
12±n/a nM
Citation
 Su, QIoannidis, SChuaqui, CAlmeida, LAlimzhanov, MBebernitz, GBell, KBlock, MHoward, THuang, SHuszar, DRead, JARivard Costa, CShi, JSu, MYe, MZinda, M Discovery of 1-methyl-1H-imidazole derivatives as potent Jak2 inhibitors. J Med Chem 57:144-58 (2014)  
Target
Name:
Tyrosine-protein kinase JAK2
Synonyms:
JAK-2 Jak2 | Janus kinase 2
Type:
PROTEIN
Mol. Mass.:
130251.33
Organism:
Mus musculus
Description:
ChEMBL_1291226
Residue:
1129
  
Inhibitor
Name:
BDBM50446982
Synonyms:
CHEMBL3116050
Type:
Small organic molecule
Emp. Form.:
C16H16FN9
Mol. Mass.:
353.3569
SMILES:
C[C@H](Nc1nc(Nc2cn(C)cn2)c2cc[nH]c2n1)c1ncc(F)cn1
: