Target
DNA gyrase subunit B
Ligand
BDBM50447300
Substrate
Meas. Tech.
ChEMBL_1291282 (CHEMBL3117272)
IC50
5.0±n/a nM
Citation
 Kale, RRKale, MGWaterson, DRaichurkar, AHameed, SPManjunatha, MRKishore Reddy, BKMalolanarasimhan, KShinde, VKoushik, KJena, LKMenasinakai, SHumnabadkar, VMadhavapeddi, PBasavarajappa, HSharma, SNandishaiah, RMahesh Kumar, KNGanguly, SAhuja, VGaonkar, SNaveen Kumar, CNOgg, DBoriack-Sjodin, PASambandamurthy, VKde Sousa, SMGhorpade, SR Thiazolopyridone ureas as DNA gyrase B inhibitors: optimization of antitubercular activity and efficacy. Bioorg Med Chem Lett 24:870-9 (2014)  
Target
Name:
DNA gyrase subunit B
Synonyms:
GYRB_MYCSM | gyrB
Type:
PROTEIN
Mol. Mass.:
74505.25
Organism:
Mycobacterium smegmatis
Description:
ChEMBL_107961
Residue:
675
  
Inhibitor
Name:
BDBM50447300
Synonyms:
CHEMBL3114207
Type:
Small organic molecule
Emp. Form.:
C20H25N5O4S
Mol. Mass.:
431.509
SMILES:
CCNC(=O)Nc1nc2cc(-c3ccn(CCOC)c(=O)c3)c(=O)n(C(C)C)c2s1
: