Target
Alkaline phosphatase, placental type
Ligand
BDBM50447435
Substrate
Meas. Tech.
ChEMBL_1288274 (CHEMBL3117348)
IC50
>100000±n/a nM
Citation
 Ardecky, RJBobkova, EVKiffer-Moreira, TBrown, BGanji, SZou, JPass, INarisawa, SIano, FGRosenstein, CCheltsov, ARascon, JHedrick, MGasior, CForster, AShi, SDahl, RVasile, SSu, YSergienko, EChung, TDKaunitz, JHoylaerts, MFPinkerton, ABMillán, JL Identification of a selective inhibitor of murine intestinal alkaline phosphatase (ML260) by concurrent ultra-high throughput screening against human and mouse isozymes. Bioorg Med Chem Lett 24:1000-4 (2014)  
Target
Name:
Alkaline phosphatase, placental type
Synonyms:
ALPP PLAP | PPB1_HUMAN
Type:
PROTEIN
Mol. Mass.:
57950.65
Organism:
Homo sapiens (Human)
Description:
ChEMBL_1506090
Residue:
535
  
Inhibitor
Name:
BDBM50447435
Synonyms:
CHEMBL3115130
Type:
Small organic molecule
Emp. Form.:
C19H21N3O5S
Mol. Mass.:
403.452
SMILES:
Cc1ccc(C)c(NC(=O)CCNS(=O)(=O)c2ccc3n(C)c(=O)oc3c2)c1
: