Target
Acetylcholinesterase
Ligand
BDBM50448132
Substrate
Meas. Tech.
ChEMBL_1292080 (CHEMBL3124377)
Kd
3200±n/a nM
Citation
 Di Pietro, OViayna, EVicente-García, EBartolini, MRamón, RJuárez-Jiménez, JClos, MVPérez, BAndrisano, VLuque, FJLavilla, RMuñoz-Torrero, D 1,2,3,4-Tetrahydrobenzo[h][1,6]naphthyridines as a new family of potent peripheral-to-midgorge-site inhibitors of acetylcholinesterase: synthesis, pharmacological evaluation and mechanistic studies. Eur J Med Chem 73:141-52 (2014)  
Target
Name:
Acetylcholinesterase
Synonyms:
ACES_ELEEL Acetylcholinesterase (EeAChE) | ache
Type:
Enzyme
Mol. Mass.:
71812.79
Organism:
Electrophorus electricus (Electric eel)
Description:
Residue:
633
  
Inhibitor
Name:
BDBM50448132
Synonyms:
CHEMBL3122150
Type:
Small organic molecule
Emp. Form.:
C28H28ClN3
Mol. Mass.:
441.995
SMILES:
CCNCc1ccc2nc(-c3ccc(Cl)cc3)c3CCCN(Cc4ccccc4)c3c2c1
: