Target
Glucocorticoid receptor
Ligand
BDBM50448168
Substrate
Meas. Tech.
ChEMBL_1292840 (CHEMBL3122504)
Ki
0.268000±n/a nM
Citation
 Carson, MWLuz, JGSuen, CMontrose, CZink, RRuan, XCheng, CCole, HAdrian, MDKohlman, DTMabry, TSnyder, NCondon, BMaletic, MClawson, DPustilnik, ACoghlan, MJ Glucocorticoid receptor modulators informed by crystallography lead to a new rationale for receptor selectivity, function, and implications for structure-based design. J Med Chem 57:849-60 (2014)  
Target
Name:
Glucocorticoid receptor
Synonyms:
GCR_HUMAN GRL Glucocorticoid receptor (GRFP) Nuclear receptor subfamily 3 group C member 1
Type:
Enzyme
Mol. Mass.:
85656.87
Organism:
Homo sapiens (Human)
Description:
P04150
Residue:
777
  
Inhibitor
Name:
BDBM50448168
Synonyms:
CHEMBL3120317
Type:
Small organic molecule
Emp. Form.:
C25H25NO4S
Mol. Mass.:
435.535
SMILES:
CC\C(c1cccc(NS(C)(=O)=O)c1)=C1/c2ccccc2OCc2cccc(OC)c12
: